Target
Adenosine receptor A1
Ligand
BDBM50037422
Substrate
Meas. Tech.
ChEMBL_29464 (CHEMBL642193)
Ki
43.1±n/a nM
Citation
 Kim, YCJi, XMelman, NLinden, JJacobson, KA Anilide derivatives of an 8-phenylxanthine carboxylic congener are highly potent and selective antagonists at human A(2B) adenosine receptors. J Med Chem 43:1165-72 (2000)  
Target
Name:
Adenosine receptor A1
Synonyms:
AA1R_RAT ADENOSINE A1 high Adenosine A1 receptor (A1) Adenosine receptors A1 | Adora1
Type:
Protein
Mol. Mass.:
36704.13
Organism:
Rattus norvegicus (rat)
Description:
Residue:
326
  
Inhibitor
Name:
BDBM50037422
Synonyms:
CHEMBL17123 | [4-(1,3-Dibutyl-2,6-dioxo-2,3,6,7-tetrahydro-1H-purin-8-yl)-phenoxy]-acetic acid
Type:
Small organic molecule
Emp. Form.:
C21H26N4O5
Mol. Mass.:
414.4549
SMILES:
CCCCn1c2nc([nH]c2c(=O)n(CCCC)c1=O)-c1ccc(OCC(O)=O)cc1
: