Target
Serine--tRNA ligase
Ligand
BDBM50530859
Substrate
Meas. Tech.
ChEMBL_1914061 (CHEMBL4416644)
Kd
290±n/a nM
Citation
 Cain, RSalimraj, RPunekar, ASBellini, DFishwick, CWGCzaplewski, LScott, DJHarris, GDowson, CGLloyd, AJRoper, DI Structure-Guided Enhancement of Selectivity of Chemical Probe Inhibitors Targeting Bacterial Seryl-tRNA Synthetase. J Med Chem 62:9703-9717 (2019)  
Target
Name:
Serine--tRNA ligase
Synonyms:
6.1.1.11 SerRS Seryl-tRNA synthetase serS
Type:
PROTEIN
Mol. Mass.:
48404.41
Organism:
Escherichia coli (strain K12)
Description:
ChEMBL_117814
Residue:
430
  
Inhibitor
Name:
BDBM50530859
Synonyms:
CHEMBL4561900
Type:
Small organic molecule
Emp. Form.:
C18H22N8O8S
Mol. Mass.:
510.481
SMILES:
N[C@@H](CO)C(=O)NS(=O)(=O)OC[C@H]1O[C@H]([C@H](O)[C@@H]1O)n1cnc2c(N)nc(nc12)-c1cccnc1
: