Target
Cyclin-dependent kinase 1/G2/mitotic-specific cyclin-B1/G2/mitotic-specific cyclin-B2/G2/mitotic-specific cyclin-B3
Ligand
BDBM7279
Substrate
Meas. Tech.
ChEMBL_50481 (CHEMBL658183)
IC50
300±n/a nM
Citation
 Kunick, CSchultz, CLemcke, TZaharevitz, DWGussio, RJalluri, RKSausville, EALeost, MMeijer, L 2-Substituted paullones: CDK1/cyclin B-inhibiting property and in vitro antiproliferative activity. Bioorg Med Chem Lett 10:567-9 (2000)  
Target
Name:
Cyclin-dependent kinase 1/G2/mitotic-specific cyclin-B1/G2/mitotic-specific cyclin-B2/G2/mitotic-specific cyclin-B3
Synonyms:
Cyclin B/Cyclin-Dependent Kinase 1 (CDK1)/G2/mitotic-specific cyclin B2/G2/mitotic-specific cyclin B3 Cyclin-dependent kinase 1/cyclin B
Type:
Mol. Mass.:
Description:
ASSAY_ID of EBI is 40085
Components:
This complex has 4 components.
Component 1
Name:
G2/mitotic-specific cyclin-B3
Synonyms:
CCNB3 CYCB3 G2/mitotic-specific cyclin-B3
Type:
PROTEIN
Mol. Mass.:
157916.84
Organism:
Homo sapiens (Human)
Description:
Residue:
1395
  
Component 2
Name:
G2/mitotic-specific cyclin-B1
Synonyms:
CCNB CCNB1_HUMAN
Type:
Enzyme Subunit
Mol. Mass.:
48340.95
Organism:
Homo sapiens (Human)
Description:
P14635
Residue:
433
  
Component 3
Name:
G2/mitotic-specific cyclin-B2
Synonyms:
CCNB2 Cyclin-dependent kinase 1/cyclin B | G2/mitotic-specific cyclin-B2
Type:
PROTEIN
Mol. Mass.:
45293.13
Organism:
Homo sapiens (Human)
Description:
Residue:
398
  
Component 4
Name:
Cyclin-dependent kinase 1
Synonyms:
CDC2 CDK1 CDKN1 Cell division protein kinase 1 P34CDC2 | p34 protein kinase
Type:
Enzyme Subunit
Mol. Mass.:
34101.08
Organism:
Homo sapiens (Human)
Description:
P06493
Residue:
297
  
Inhibitor
Name:
BDBM7279
Synonyms:
2-(3-hydroxy-1-propinyl)-9-trifluoromethylpaullone CHEMBL346406 Paullone Analog 18
Type:
Small organic molecule
Emp. Form.:
C20H13F3N2O2
Mol. Mass.:
370.3246
SMILES:
OCC#Cc1ccc2NC(=O)Cc3c([nH]c4ccc(cc34)C(F)(F)F)-c2c1
: