Target
Prostaglandin G/H synthase 1
Ligand
BDBM50531487
Substrate
Meas. Tech.
ChEMBL_1920306 (CHEMBL4423151)
IC50
120±n/a nM
Citation
 Pati, MLVitale, PFerorelli, SIaselli, MMiciaccia, MBoccarelli, ADi Mauro, GDFortuna, CGSouza Domingos, TFRodrigues Pereira da Silva, LCde Pádula, MCabral, LMSathler, PCVacca, AScilimati, APerrone, MG Translational impact of novel widely pharmacological characterized mofezolac-derived COX-1 inhibitors combined with bortezomib on human multiple myeloma cell lines viability. Eur J Med Chem 164:59-76 (2019)  
Target
Name:
Prostaglandin G/H synthase 1
Synonyms:
COX1 Cyclooxygenase-1 (COX-1) PTGS1 | Prostaglandin G/H synthase (cyclooxygenase)
Type:
Protein
Mol. Mass.:
68868.60
Organism:
Ovis aries (Sheep)
Description:
Residue:
600
  
Inhibitor
Name:
BDBM50531487
Synonyms:
CHEMBL4571499
Type:
Small organic molecule
Emp. Form.:
C19H19NO4
Mol. Mass.:
325.3585
SMILES:
COc1ccc(cc1)-c1noc(CCO)c1-c1ccc(OC)cc1
: