Target
Prostaglandin G/H synthase 2
Ligand
BDBM50531487
Substrate
Meas. Tech.
ChEMBL_1920307 (CHEMBL4423152)
IC50
190±n/a nM
Citation
 Pati, MLVitale, PFerorelli, SIaselli, MMiciaccia, MBoccarelli, ADi Mauro, GDFortuna, CGSouza Domingos, TFRodrigues Pereira da Silva, LCde Pádula, MCabral, LMSathler, PCVacca, AScilimati, APerrone, MG Translational impact of novel widely pharmacological characterized mofezolac-derived COX-1 inhibitors combined with bortezomib on human multiple myeloma cell lines viability. Eur J Med Chem 164:59-76 (2019)  
Target
Name:
Prostaglandin G/H synthase 2
Synonyms:
COX2 Cyclooxygenase 2 (COX-2) Cyclooxygenase-2 (COX-2 AA) Cyclooxygenase-2 (COX-2) PGH2_HUMAN PHS II Prostaglandin E synthase/G/H synthase 2 Prostaglandin-endoperoxide synthase 2
Type:
Enzyme
Mol. Mass.:
69003.89
Organism:
Homo sapiens (Human)
Description:
Recombinant Cox-2 provided by Cayman (Cayman Chemical Co.,Ann Arbor, MI).
Residue:
604
  
Inhibitor
Name:
BDBM50531487
Synonyms:
CHEMBL4571499
Type:
Small organic molecule
Emp. Form.:
C19H19NO4
Mol. Mass.:
325.3585
SMILES:
COc1ccc(cc1)-c1noc(CCO)c1-c1ccc(OC)cc1
: