Target
Carbonic anhydrase 9
Ligand
BDBM50531513
Substrate
Meas. Tech.
ChEMBL_1920404 (CHEMBL4423249)
Ki
0.390000±n/a nM
Citation
 Krasavin, MShetnev, ASharonova, TBaykov, SKalinin, SNocentini, ASharoyko, VPoli, GTuccinardi, TPresnukhina, STennikova, TBSupuran, CT Continued exploration of 1,2,4-oxadiazole periphery for carbonic anhydrase-targeting primary arene sulfonamides: Discovery of subnanomolar inhibitors of membrane-bound hCA IX isoform that selectively kill cancer cells in hypoxic environment. Eur J Med Chem 164:92-105 (2019)  
Target
Name:
Carbonic anhydrase 9
Synonyms:
CA-IX CAH9_HUMAN Carbonic anhydrase 9 (CA IX) Carbonic anhydrase 9 precursor Carbonic anhydrase IX (CAIX) Carbonic anhydrases; II & IX MN RCC-associated antigen G250
Type:
Enzyme
Mol. Mass.:
49669.03
Organism:
Homo sapiens (Human)
Description:
Catalytic domain of human cloned isozyme was used in the assay
Residue:
459
  
Inhibitor
Name:
BDBM50531513
Synonyms:
CHEMBL4525976
Type:
Small organic molecule
Emp. Form.:
C11H8N4O3S2
Mol. Mass.:
308.336
SMILES:
NS(=O)(=O)c1cc(cs1)-c1nc(no1)-c1ccccn1
: