Target
Metabotropic glutamate receptor 7
Ligand
BDBM50531687
Substrate
Meas. Tech.
ChEMBL_1920591 (CHEMBL4423436)
IC50
347±n/a nM
Citation
 Reed, CWYohn, SEWashecheck, JPRoenfanz, HFQuitalig, MCLuscombe, VBJenkins, MTRodriguez, ALEngers, DWBlobaum, ALConn, PJNiswender, CMLindsley, CW Discovery of an Orally Bioavailable and Central Nervous System (CNS) Penetrant mGlu J Med Chem 62:1690-1695 (2019)  
Target
Name:
Metabotropic glutamate receptor 7
Synonyms:
GRM7_RAT Grm7 Metabotropic glutamate receptor 7 (mGlu7) mGlu7
Type:
Enzyme
Mol. Mass.:
102244.48
Organism:
Rattus norvegicus (Rat)
Description:
P35400
Residue:
915
  
Inhibitor
Name:
BDBM50531687
Synonyms:
CHEMBL4445682
Type:
Small organic molecule
Emp. Form.:
C21H19F3N4O4
Mol. Mass.:
448.3952
SMILES:
COc1cc(ccc1OCC1CC1)C(=O)Nc1cc(OC(F)(F)F)ccc1-n1cncn1
: