Target
Metabotropic glutamate receptor 6
Ligand
BDBM50531687
Substrate
Meas. Tech.
ChEMBL_1920616 (CHEMBL4423461)
IC50
>10000±n/a nM
Citation
 Reed, CWYohn, SEWashecheck, JPRoenfanz, HFQuitalig, MCLuscombe, VBJenkins, MTRodriguez, ALEngers, DWBlobaum, ALConn, PJNiswender, CMLindsley, CW Discovery of an Orally Bioavailable and Central Nervous System (CNS) Penetrant mGlu J Med Chem 62:1690-1695 (2019)  
Target
Name:
Metabotropic glutamate receptor 6
Synonyms:
GPRC1F GRM6_HUMAN Metabotropic glutamate receptor 6 metabotropic glutamate 6
Type:
Enzyme Catalytic Domain
Mol. Mass.:
95479.26
Organism:
Homo sapiens (Human)
Description:
metabotropic glutamate 6 GRM6 HUMAN::O15303
Residue:
877
  
Inhibitor
Name:
BDBM50531687
Synonyms:
CHEMBL4445682
Type:
Small organic molecule
Emp. Form.:
C21H19F3N4O4
Mol. Mass.:
448.3952
SMILES:
COc1cc(ccc1OCC1CC1)C(=O)Nc1cc(OC(F)(F)F)ccc1-n1cncn1
: