Target
AMP deaminase 1
Ligand
BDBM50087311
Substrate
Meas. Tech.
ChEMBL_31893 (CHEMBL640310)
Ki
20000±n/a nM
Citation
 Bookser, BCKasibhatla, SRAppleman, JRErion, MD AMP deaminase inhibitors. 2. Initial discovery of a non-nucleotide transition-state inhibitor series. J Med Chem 43:1495-507 (2000)  
Target
Name:
AMP deaminase 1
Synonyms:
AMP deaminase 1 (hAMPD1) AMPD1 Myoadenylate deaminase
Type:
Protein
Mol. Mass.:
90225.27
Organism:
Homo sapiens (Human)
Description:
Residue:
780
  
Inhibitor
Name:
BDBM50087311
Synonyms:
8-(8-Hydroxy-7,8-dihydro-6H-imidazo[4,5-d][1,3]diazepin-3-yl)-octanoic acid methyl ester | CHEMBL38306
Type:
Small organic molecule
Emp. Form.:
C15H24N4O3
Mol. Mass.:
308.3761
SMILES:
COC(=O)CCCCCCCn1cnc2C(O)CNC=Nc12
: