Target
Coagulation factor X
Ligand
BDBM50087536
Substrate
Meas. Tech.
ChEBML_48820
Ki
0.100000±n/a nM
Citation
 Pruitt, JRPinto, DJEstrella, MJBostrom, LLKnabb, RMWong, PCWright, MRWexler, RR Isoxazolines and isoxazoles as factor Xa inhibitors. Bioorg Med Chem Lett 10:685-9 (2000)  
Target
Name:
Coagulation factor X
Synonyms:
Activated coagulation factor X (FXa) Coagulation factor X precursor F10 Factor X heavy chain Factor Xa Stuart-Prower factor
Type:
Enzyme
Mol. Mass.:
54726.60
Organism:
Homo sapiens (Human)
Description:
Residue:
488
  
Inhibitor
Name:
BDBM50087536
Synonyms:
3-(3-Carbamimidoyl-phenyl)-isoxazole-4-carboxylic acid (2'-methanesulfonyl-biphenyl-4-yl)-amide | CHEMBL159816
Type:
Small organic molecule
Emp. Form.:
C24H20N4O4S
Mol. Mass.:
460.505
SMILES:
CS(=O)(=O)c1ccccc1-c1ccc(NC(=O)c2conc2-c2cccc(c2)C(N)=N)cc1
: