Target
Thymidylate synthase
Ligand
BDBM50088168
Substrate
Meas. Tech.
ChEMBL_209994 (CHEMBL811641)
Ki
69000±n/a nM
Citation
 Bavetsias, VMarriott, JHMelin, CKimbell, RMatusiak, ZSBoyle, FTJackman, AL Design and synthesis of Cyclopenta[g]quinazoline-based antifolates as inhibitors of thymidylate synthase and potential antitumor agents(,). J Med Chem 43:1910-26 (2000)  
Target
Name:
Thymidylate synthase
Synonyms:
TSase Thymidylate Synthase (TS) thyA
Type:
Enzyme
Mol. Mass.:
36576.54
Organism:
Lactobacillus casei
Description:
Residue:
316
  
Inhibitor
Name:
BDBM50088168
Synonyms:
2-(4-Carboxy-4-{4-[(2-methyl-4-oxo-4,6,7,8-tetrahydro-3H-cyclopenta[g]quinazolin-6-yl)-prop-2-ynyl-amino]-benzoylamino}-butyrylamino)-4-(1-carboxymethyl-1H-tetrazol-5-yl)-butyric acid | CHEMBL299273
Type:
Small organic molecule
Emp. Form.:
C34H35N9O9
Mol. Mass.:
713.6966
SMILES:
Cc1nc2cc3CCC(N(CC#C)c4ccc(cc4)C(=O)N[C@@H](CCC(=O)N[C@@H](CCc4nnnn4CC(O)=O)C(O)=O)C(O)=O)c3cc2c(=O)[nH]1
: