Target
Thymidylate synthase
Ligand
BDBM50088159
Substrate
Meas. Tech.
ChEMBL_209985 (CHEMBL821413)
Ki
0.2±n/a nM
Citation
 Bavetsias, VMarriott, JHMelin, CKimbell, RMatusiak, ZSBoyle, FTJackman, AL Design and synthesis of Cyclopenta[g]quinazoline-based antifolates as inhibitors of thymidylate synthase and potential antitumor agents(,). J Med Chem 43:1910-26 (2000)  
Target
Name:
Thymidylate synthase
Synonyms:
TS TYSY_MOUSE | Tyms
Type:
PROTEIN
Mol. Mass.:
34957.15
Organism:
Mus musculus
Description:
ChEMBL_1340097
Residue:
307
  
Inhibitor
Name:
BDBM50088159
Synonyms:
4-[3-Carboxy-1-(1H-tetrazol-5-yl)-propylcarbamoyl]-2-{4-[(2-methyl-4-oxo-4,6,7,8-tetrahydro-3H-cyclopenta[g]quinazolin-6-yl)-prop-2-ynyl-amino]-benzoylamino}-butyric acid | CHEMBL61300
Type:
Small organic molecule
Emp. Form.:
C32H33N9O7
Mol. Mass.:
655.6605
SMILES:
Cc1nc2cc3CCC(N(CC#C)c4ccc(cc4)C(=O)N[C@@H](CCC(=O)N[C@H](CCC(O)=O)c4nnn[nH]4)C(O)=O)c3cc2c(=O)[nH]1
: