Target
Thymidylate synthase
Ligand
BDBM50408874
Substrate
Meas. Tech.
ChEMBL_209985 (CHEMBL821413)
Ki
2.2±n/a nM
Citation
 Bavetsias, VMarriott, JHMelin, CKimbell, RMatusiak, ZSBoyle, FTJackman, AL Design and synthesis of Cyclopenta[g]quinazoline-based antifolates as inhibitors of thymidylate synthase and potential antitumor agents(,). J Med Chem 43:1910-26 (2000)  
Target
Name:
Thymidylate synthase
Synonyms:
TS TYSY_MOUSE | Tyms
Type:
PROTEIN
Mol. Mass.:
34957.15
Organism:
Mus musculus
Description:
ChEMBL_1340097
Residue:
307
  
Inhibitor
Name:
BDBM50408874
Synonyms:
CHEMBL299062
Type:
Small organic molecule
Emp. Form.:
C32H33N9O7
Mol. Mass.:
655.6605
SMILES:
C[C@@H](NC(=O)Cn1nnnc1CC[C@H](NC(=O)c1ccc(cc1)N(CC#C)C1CCc2cc3nc(C)[nH]c(=O)c3cc12)C(O)=O)C(O)=O
: