Target
Thymidylate synthase
Ligand
BDBM50408876
Substrate
Meas. Tech.
ChEMBL_209985 (CHEMBL821413)
Ki
0.78±n/a nM
Citation
 Bavetsias, VMarriott, JHMelin, CKimbell, RMatusiak, ZSBoyle, FTJackman, AL Design and synthesis of Cyclopenta[g]quinazoline-based antifolates as inhibitors of thymidylate synthase and potential antitumor agents(,). J Med Chem 43:1910-26 (2000)  
Target
Name:
Thymidylate synthase
Synonyms:
TS TYSY_MOUSE | Tyms
Type:
PROTEIN
Mol. Mass.:
34957.15
Organism:
Mus musculus
Description:
ChEMBL_1340097
Residue:
307
  
Inhibitor
Name:
BDBM50408876
Synonyms:
CHEMBL434602
Type:
Small organic molecule
Emp. Form.:
C33H35N5O9
Mol. Mass.:
645.6591
SMILES:
CN([C@H](CCC(O)=O)C(O)=O)C(=O)CC[C@H](NC(=O)c1ccc(cc1)N(CC#C)C1CCc2cc3nc(C)[nH]c(=O)c3cc12)C(O)=O
: