Target
Reduced folate transporter
Ligand
BDBM18050
Substrate
Meas. Tech.
ChEMBL_209993 (CHEMBL811640)
Ki
3500±n/a nM
Citation
 Bavetsias, VMarriott, JHMelin, CKimbell, RMatusiak, ZSBoyle, FTJackman, AL Design and synthesis of Cyclopenta[g]quinazoline-based antifolates as inhibitors of thymidylate synthase and potential antitumor agents(,). J Med Chem 43:1910-26 (2000)  
Target
Name:
Reduced folate transporter
Synonyms:
FLOT1 Folate transporter 1 Intestinal folate carrier RFC Reduced folate carrier protein SLC19A1 | Solute carrier family 19 member 1
Type:
PROTEIN
Mol. Mass.:
64885.16
Organism:
Homo sapiens (Human)
Description:
ChEMBL_1469594
Residue:
591
  
Inhibitor
Name:
BDBM18050
Synonyms:
2-[(4-{[(2,4-diaminopteridin-6-yl)methyl](methyl)amino}phenyl)formamido]pentanedioic acid MTX cid_126941
Type:
Small organic molecule
Emp. Form.:
C20H22N8O5
Mol. Mass.:
454.4393
SMILES:
CN(Cc1cnc2nc(N)nc(N)c2n1)c1ccc(cc1)C(=O)N[C@@H](CCC(O)=O)C(O)=O
: