Target
Glutamate receptor ionotropic, kainate 1
Ligand
BDBM50088213
Substrate
Meas. Tech.
ChEMBL_90440 (CHEMBL698072)
Ki
56±n/a nM
Citation
 Pedregal, CCollado, IEscribano, AEzquerra, JDomínguez, CMateo, AIRubio, ABaker, SRGoldsworthy, JKamboj, RKBallyk, BAHoo, KBleakman, D 4-Alkyl- and 4-cinnamylglutamic acid analogues are potent GluR5 kainate receptor agonists. J Med Chem 43:1958-68 (2000)  
Target
Name:
Glutamate receptor ionotropic, kainate 1
Synonyms:
GLUR5 GRIK1_HUMAN Glutamate kainate Glutamate receptor ionotropic kainate 1 Glutamate-Kainate Grik1 protein | hmglur5 flipr
Type:
Enzyme Catalytic Domain
Mol. Mass.:
103984.96
Organism:
Homo sapiens (Human)
Description:
P39086
Residue:
918
  
Inhibitor
Name:
BDBM50088213
Synonyms:
(2S,4R)-4-allyl glutamate CHEMBL62057 | LY-310214
Type:
Small organic molecule
Emp. Form.:
C8H13NO4
Mol. Mass.:
187.1931
SMILES:
N[C@@H](C[C@@H](CC=C)C(O)=O)C(O)=O
: