Target
Glutamate receptor ionotropic, kainate 1
Ligand
BDBM50088200
Substrate
Meas. Tech.
ChEMBL_90440 (CHEMBL698072)
Ki
52±n/a nM
Citation
 Pedregal, CCollado, IEscribano, AEzquerra, JDomínguez, CMateo, AIRubio, ABaker, SRGoldsworthy, JKamboj, RKBallyk, BAHoo, KBleakman, D 4-Alkyl- and 4-cinnamylglutamic acid analogues are potent GluR5 kainate receptor agonists. J Med Chem 43:1958-68 (2000)  
Target
Name:
Glutamate receptor ionotropic, kainate 1
Synonyms:
GLUR5 GRIK1_HUMAN Glutamate kainate Glutamate receptor ionotropic kainate 1 Glutamate-Kainate Grik1 protein | hmglur5 flipr
Type:
Enzyme Catalytic Domain
Mol. Mass.:
103984.96
Organism:
Homo sapiens (Human)
Description:
P39086
Residue:
918
  
Inhibitor
Name:
BDBM50088200
Synonyms:
CHEMBL291491 | E-2-Amino-4-[3-(4-trifluoromethyl-phenyl)-allyl]-pentanedioic acid
Type:
Small organic molecule
Emp. Form.:
C15H16F3NO4
Mol. Mass.:
331.287
SMILES:
N[C@@H](C[C@@H](C\C=C\c1ccc(cc1)C(F)(F)F)C(O)=O)C(O)=O
: