Target
Glutamate receptor ionotropic, kainate 3
Ligand
BDBM50088216
Substrate
Meas. Tech.
ChEMBL_90599 (CHEMBL701555)
Ki
42±n/a nM
Citation
 Pedregal, CCollado, IEscribano, AEzquerra, JDomínguez, CMateo, AIRubio, ABaker, SRGoldsworthy, JKamboj, RKBallyk, BAHoo, KBleakman, D 4-Alkyl- and 4-cinnamylglutamic acid analogues are potent GluR5 kainate receptor agonists. J Med Chem 43:1958-68 (2000)  
Target
Name:
Glutamate receptor ionotropic, kainate 3
Synonyms:
EAA5 GLUR7 GRIK3_HUMAN Glutamate receptor 7 Glutamate receptor ionotropic kainate 3 Glutamate-Kainate 7
Type:
Enzyme Catalytic Domain
Mol. Mass.:
104046.44
Organism:
Homo sapiens (Human)
Description:
Glutamate-Kainate 7 0 HUMAN::Q13003
Residue:
919
  
Inhibitor
Name:
BDBM50088216
Synonyms:
CHEMBL59284 LY-339296
Type:
Small organic molecule
Emp. Form.:
C15H19NO5
Mol. Mass.:
293.3151
SMILES:
COc1ccccc1\C=C\C[C@H](C[C@H](N)C(O)=O)C(O)=O
: