Target
Glutamate receptor ionotropic, kainate 2
Ligand
BDBM50088229
Substrate
Meas. Tech.
ChEMBL_90582 (CHEMBL701166)
Ki
160±n/a nM
Citation
 Pedregal, CCollado, IEscribano, AEzquerra, JDomínguez, CMateo, AIRubio, ABaker, SRGoldsworthy, JKamboj, RKBallyk, BAHoo, KBleakman, D 4-Alkyl- and 4-cinnamylglutamic acid analogues are potent GluR5 kainate receptor agonists. J Med Chem 43:1958-68 (2000)  
Target
Name:
Glutamate receptor ionotropic, kainate 2
Synonyms:
EAA4 GLUR6 GRIK2_HUMAN GluR-6 Glutamate receptor 6 Glutamate receptor, ionotropic kainate 2 Glutamate-Kainate, GluR6
Type:
Enzyme Catalytic Domain
Mol. Mass.:
102592.78
Organism:
Homo sapiens (Human)
Description:
Q13002
Residue:
908
  
Inhibitor
Name:
BDBM50088229
Synonyms:
2-Amino-4-prop-2-ynyl-pentanedioic acid | CHEMBL59551
Type:
Small organic molecule
Emp. Form.:
C8H11NO4
Mol. Mass.:
185.1772
SMILES:
N[C@@H](C[C@@H](CC#C)C(O)=O)C(O)=O
: