Target
Neuropeptide Y receptor type 4
Ligand
BDBM50532413
Substrate
Meas. Tech.
ChEMBL_1923152 (CHEMBL4426108)
EC50
3.7±n/a nM
Citation
 Liu, MMountford, SJRichardson, RRGroenen, MHolliday, NDThompson, PE Optically Pure, Structural, and Fluorescent Analogues of a Dimeric Y4 Receptor Agonist Derived by an Olefin Metathesis Approach. J Med Chem 59:6059-69 (2016)  
Target
Name:
Neuropeptide Y receptor type 4
Synonyms:
NPY-Y4 NPY4R PP1 Pancreatic polypeptide receptor 1
Type:
Enzyme Catalytic Domain
Mol. Mass.:
42207.58
Organism:
Homo sapiens (Human)
Description:
NPY-Y4 PPYR1 HUMAN::P50391
Residue:
375
  
Inhibitor
Name:
BDBM50532413
Synonyms:
CHEMBL4546224
Type:
Small organic molecule
Emp. Form.:
C116H163ClN30O20
Mol. Mass.:
2333.177
SMILES:
[Cl-].CCN(CC)c1ccc2c(-c3ccccc3C(=O)N3CCN(CC3)C(=O)CCC(=O)N[C@H](C\C=C/C[C@@H](N)C(=O)N[C@@H](Cc3ccc(O)cc3)C(=O)N[C@@H](CCCNC(N)=N)C(=O)N[C@@H](CC(C)C)C(=O)N[C@@H](CCCNC(N)=N)C(=O)N[C@@H](Cc3ccc(O)cc3)C(N)=O)C(=O)N[C@@H](Cc3ccc(O)cc3)C(=O)N[C@@H](CCCNC(N)=N)C(=O)N[C@@H](CC(C)C)C(=O)N[C@@H](CCCNC(N)=N)C(=O)N[C@@H](Cc3ccc(O)cc3)C(N)=O)c3ccc(cc3oc2c1)=[N+](CC)CC
: