Target
Neuropeptide Y receptor type 4
Ligand
BDBM50532410
Substrate
Meas. Tech.
ChEMBL_1923152 (CHEMBL4426108)
EC50
4.6±n/a nM
Citation
 Liu, MMountford, SJRichardson, RRGroenen, MHolliday, NDThompson, PE Optically Pure, Structural, and Fluorescent Analogues of a Dimeric Y4 Receptor Agonist Derived by an Olefin Metathesis Approach. J Med Chem 59:6059-69 (2016)  
Target
Name:
Neuropeptide Y receptor type 4
Synonyms:
NPY-Y4 NPY4R PP1 Pancreatic polypeptide receptor 1
Type:
Enzyme Catalytic Domain
Mol. Mass.:
42207.58
Organism:
Homo sapiens (Human)
Description:
NPY-Y4 PPYR1 HUMAN::P50391
Residue:
375
  
Inhibitor
Name:
BDBM50532410
Synonyms:
CHEMBL4456247
Type:
Small organic molecule
Emp. Form.:
C80H124N26O16
Mol. Mass.:
1706.0052
SMILES:
CC(C)C[C@H](NC(=O)[C@H](CCCNC(N)=N)NC(=O)[C@H](Cc1ccc(O)cc1)NC(=O)[C@H](N)CCCC[C@@H](N)C(=O)N[C@@H](Cc1ccc(O)cc1)C(=O)N[C@@H](CCCNC(N)=N)C(=O)N[C@@H](CC(C)C)C(=O)N[C@@H](CCCNC(N)=N)C(=O)N[C@@H](Cc1ccc(O)cc1)C(N)=O)C(=O)N[C@@H](CCCNC(N)=N)C(=O)N[C@@H](Cc1ccc(O)cc1)C(N)=O
: