Target
Sigma non-opioid intracellular receptor 1
Ligand
BDBM50532501
Substrate
Meas. Tech.
ChEMBL_1923200 (CHEMBL4426156)
Ki
3.7±n/a nM
Citation
 Sun, HShi, MZhang, WZheng, YMXu, YZShi, JJLiu, TGunosewoyo, HPang, TGao, ZBYang, FTang, JYu, LF Development of Novel Alkoxyisoxazoles as Sigma-1 Receptor Antagonists with Antinociceptive Efficacy. J Med Chem 59:6329-43 (2016)  
Target
Name:
Sigma non-opioid intracellular receptor 1
Synonyms:
Opioid receptor SGMR1_RAT Sigma non-opioid intracellular receptor 1 Sigma-1 | Sigmar1
Type:
Enzyme Catalytic Domain
Mol. Mass.:
25266.54
Organism:
RAT
Description:
Q9R0C9
Residue:
223
  
Inhibitor
Name:
BDBM50532501
Synonyms:
CHEMBL4452090
Type:
Small organic molecule
Emp. Form.:
C14H19ClN2O3
Mol. Mass.:
298.765
SMILES:
Cl.CCNCCOc1cc(COc2ccccc2)on1
: