Target
Endothelin-1 receptor
Ligand
BDBM50532599
Substrate
Meas. Tech.
ChEMBL_1923367 (CHEMBL4426323)
Ki
0.110000±n/a nM
Citation
 Boss, CBolli, MHGatfield, J From bosentan (TracleerŪ) to macitentan (OpsumitŪ): The medicinal chemistry perspective. Bioorg Med Chem Lett 26:3381-94 (2016)  
Target
Name:
Endothelin-1 receptor
Synonyms:
EDNRA ET-A ETA-R Endothelin receptor type A hET-AR
Type:
Enzyme Catalytic Domain
Mol. Mass.:
48736.88
Organism:
Homo sapiens (Human)
Description:
P25101
Residue:
427
  
Inhibitor
Name:
BDBM50532599
Synonyms:
CHEMBL4559129
Type:
Small organic molecule
Emp. Form.:
C27H30N2O6S
Mol. Mass.:
510.602
SMILES:
CCCc1nc(C)ccc1O[C@@H](C(=O)NS(=O)(=O)c1ccc(cc1)C(C)C)c1ccc2OCOc2c1
: