Target
ATP-dependent translocase ABCB1
Ligand
BDBM50532707
Substrate
Meas. Tech.
ChEMBL_1923569 (CHEMBL4426525)
EC50
0.600000±n/a nM
Citation
 Guglielmo, SLazzarato, LContino, MPerrone, MGChegaev, KCarrieri, AFruttero, RColabufo, NAGasco, A Structure-Activity Relationship Studies on Tetrahydroisoquinoline Derivatives: [4'-(6,7-Dimethoxy-3,4-dihydro-1H-isoquinolin-2-ylmethyl)biphenyl-4-ol] (MC70) Conjugated through Flexible Alkyl Chains with Furazan Moieties Gives Rise to Potent and Selective Ligands of P-glycoprotein. J Med Chem 59:6729-38 (2016)  
Target
Name:
ATP-dependent translocase ABCB1
Synonyms:
ABCB1 MDR1_HUMAN Multidrug resistance protein 1 P-glycoprotein (P-gp) PGY1
Type:
Protein
Mol. Mass.:
141503.50
Organism:
Homo sapiens (Human)
Description:
P08183
Residue:
1280
  
Inhibitor
Name:
BDBM50532707
Synonyms:
CHEMBL4585968
Type:
Small organic molecule
Emp. Form.:
C29H31N3O6
Mol. Mass.:
517.5729
SMILES:
COc1nonc1OCCOc1ccc(cc1)-c1ccc(CN2CCc3cc(OC)c(OC)cc3C2)cc1
: