Target
Acetylcholinesterase
Ligand
BDBM50532731
Substrate
Meas. Tech.
ChEMBL_1923703 (CHEMBL4426659)
Ki
1370±n/a nM
Citation
 Pisani, LFarina, RCatto, MIacobazzi, RMNicolotti, OCellamare, SMangiatordi, GFDenora, NSoto-Otero, RSiragusa, LAltomare, CDCarotti, A Exploring Basic Tail Modifications of Coumarin-Based Dual Acetylcholinesterase-Monoamine Oxidase B Inhibitors: Identification of Water-Soluble, Brain-Permeant Neuroprotective Multitarget Agents. J Med Chem 59:6791-806 (2016)  
Target
Name:
Acetylcholinesterase
Synonyms:
ACES_ELEEL Acetylcholinesterase (EeAChE) | ache
Type:
Enzyme
Mol. Mass.:
71812.79
Organism:
Electrophorus electricus (Electric eel)
Description:
Residue:
633
  
Inhibitor
Name:
BDBM50532731
Synonyms:
CHEMBL4571763
Type:
Small organic molecule
Emp. Form.:
C24H27NO3
Mol. Mass.:
377.4761
SMILES:
Cc1c(C)c(=O)oc2cc(OCC3CCCN(Cc4ccccc4)C3)ccc12
: