Target
5-hydroxytryptamine receptor 1A
Ligand
BDBM50088689
Substrate
Meas. Tech.
ChEBML_1153
Ki
6.8±n/a nM
Citation
 Modica, MSantagati, MSantagati, ARusso, FCagnotto, AGoegan, MMennini, T High potent and selective arylpiperazine derivatives as ligands for the 5-HT1A receptor. Bioorg Med Chem Lett 10:1089-92 (2000)  
Target
Name:
5-hydroxytryptamine receptor 1A
Synonyms:
5-HT-1A 5-HT1A 5-hydroxytryptamine receptor 1A (5HT1A) 5ht1a Htr1a Serotonin 1a (5-HT1a) receptor/Adrenergic receptor alpha-1 | Serotonin receptor 1A
Type:
G Protein-Coupled Receptor (GPCR)
Mol. Mass.:
46445.29
Organism:
Rattus norvegicus (rat)
Description:
Binding assays were performed using rat hippocampal membranes.
Residue:
422
  
Inhibitor
Name:
BDBM50088689
Synonyms:
1-{3-[5-(2-Ethoxy-phenyl)-[1,3,4]thiadiazol-2-ylsulfanyl]-propyl}-4-(2-methoxy-phenyl)-piperazine | CHEMBL418343
Type:
Small organic molecule
Emp. Form.:
C24H30N4O2S2
Mol. Mass.:
470.651
SMILES:
CCOc1ccccc1-c1nnc(SCCCN2CCN(CC2)c2ccccc2OC)s1
: