Target
Alpha-1A/Alpha-1B/Alpha-1D adrenergic receptor
Ligand
BDBM50056384
Substrate
Meas. Tech.
ChEMBL_34597 (CHEMBL645556)
Ki
2.5±n/a nM
Citation
 Modica, MSantagati, MSantagati, ARusso, FCagnotto, AGoegan, MMennini, T High potent and selective arylpiperazine derivatives as ligands for the 5-HT1A receptor. Bioorg Med Chem Lett 10:1089-92 (2000)  
Target
Name:
Alpha-1A/Alpha-1B/Alpha-1D adrenergic receptor
Synonyms:
Adrenergic receptor alpha-1 alpha-1 Adrenergic Receptor
Type:
Mol. Mass.:
Description:
ASSAY_ID of EBI is 303470
Components:
This complex has 3 components.
Component 1
Name:
Alpha-1B adrenergic receptor
Synonyms:
ADA1B_RAT Alpha 1B-adrenoceptor Alpha adrenergic receptor 1A and 1B Alpha-1Adrenoceptor Alpha-1B adrenoreceptor | adrenergic Alpha1B
Type:
G Protein-Coupled Receptor (GPCR)
Mol. Mass.:
56606.71
Organism:
Rattus norvegicus (rat)
Description:
Receptor binding assays were performed using rat cortical membranes.
Residue:
515
  
Component 2
Name:
Alpha-1A adrenergic receptor
Synonyms:
ADA1A_RAT Adra1c Alpha-1A adrenoceptor Alpha-1C adrenergic receptor | adrenergic Alpha1A
Type:
Protein
Mol. Mass.:
51620.15
Organism:
Rattus norvegicus (Rat)
Description:
P43140
Residue:
466
  
Component 3
Name:
Alpha-1D adrenergic receptor
Synonyms:
ADA1D_RAT Adra1d Alpha-1D adrenergic receptor | Serotonin 1a (5-HT1a) receptor/Adrenergic receptor alpha-1
Type:
Protein
Mol. Mass.:
59375.97
Organism:
Rattus norvegicus (Rat)
Description:
P23944
Residue:
561
  
Inhibitor
Name:
BDBM50056384
Synonyms:
3-Amino-2-{3-[4-(2-methoxy-phenyl)-piperazin-1-yl]-propylsulfanyl}-3H-thieno[2,3-d]pyrimidin-4-one | CHEMBL440599
Type:
Small organic molecule
Emp. Form.:
C20H25N5O2S2
Mol. Mass.:
431.575
SMILES:
COc1ccccc1N1CCN(CCCSc2nc3sccc3c(=O)n2N)CC1
: