Target
Mu-type opioid receptor
Ligand
BDBM50088732
Substrate
Meas. Tech.
ChEBML_148989
Ki
128±n/a nM
Citation
 Boyd, RECarson, JRCodd, EEGauthier, ADNeilson, LAZhang, SP Synthesis and binding affinities of 4-diarylaminotropanes, a new class of delta opioid agonists. Bioorg Med Chem Lett 10:1109-11 (2000)  
Target
Name:
Mu-type opioid receptor
Synonyms:
MOR-1 Mu-type opioid receptor (MOR) OPRM_RAT Opioid receptor B Ror-b
Type:
G Protein-Coupled Receptor (GPCR)
Mol. Mass.:
44503.11
Organism:
Rattus norvegicus (rat)
Description:
Competition binding assays were carried out using membrane preparations from transfected HN9.10 cells that constitutively expressed the mu opioid receptor.
Residue:
398
  
Inhibitor
Name:
BDBM50088732
Synonyms:
CHEMBL13309 | N,N-Dimethyl-4-[((1R,3S,5S)-8-phenethyl-8-aza-bicyclo[3.2.1]oct-3-yl)-phenyl-amino]-benzamide
Type:
Small organic molecule
Emp. Form.:
C30H35N3O
Mol. Mass.:
453.6184
SMILES:
CN(C)C(=O)c1ccc(cc1)N([C@H]1C[C@@H]2CC[C@H](C1)N2CCc1ccccc1)c1ccccc1
: