Target
Delta-type opioid receptor
Ligand
BDBM50088709
Substrate
Meas. Tech.
ChEBML_147034
Ki
24±n/a nM
Citation
 Boyd, RECarson, JRCodd, EEGauthier, ADNeilson, LAZhang, SP Synthesis and binding affinities of 4-diarylaminotropanes, a new class of delta opioid agonists. Bioorg Med Chem Lett 10:1109-11 (2000)  
Target
Name:
Delta-type opioid receptor
Synonyms:
Cytochrome P450 3A4 Delta opioid receptor Delta-type opioid receptor (DOR) OPRD_RAT Opioid receptor Opioid receptors; mu & delta Ror-a | Voltage-gated potassium channel
Type:
G Protein-Coupled Receptor (GPCR)
Mol. Mass.:
40465.04
Organism:
Rattus norvegicus (rat)
Description:
Competition binding assays were using CHO-K1 cell membranes expressing the opioid receptor.
Residue:
372
  
Inhibitor
Name:
BDBM50088709
Synonyms:
4-[(1-Allyl-piperidin-4-yl)-phenyl-amino]-N,N-diethyl-benzamide | CHEMBL13403
Type:
Small organic molecule
Emp. Form.:
C25H33N3O
Mol. Mass.:
391.549
SMILES:
CCN(CC)C(=O)c1ccc(cc1)N(C1CCN(CC=C)CC1)c1ccccc1
: