Target
Delta-type opioid receptor
Ligand
BDBM50088734
Substrate
Meas. Tech.
ChEBML_147034
Ki
4±n/a nM
Citation
 Boyd, RECarson, JRCodd, EEGauthier, ADNeilson, LAZhang, SP Synthesis and binding affinities of 4-diarylaminotropanes, a new class of delta opioid agonists. Bioorg Med Chem Lett 10:1109-11 (2000)  
Target
Name:
Delta-type opioid receptor
Synonyms:
Cytochrome P450 3A4 Delta opioid receptor Delta-type opioid receptor (DOR) OPRD_RAT Opioid receptor Opioid receptors; mu & delta Ror-a | Voltage-gated potassium channel
Type:
G Protein-Coupled Receptor (GPCR)
Mol. Mass.:
40465.04
Organism:
Rattus norvegicus (rat)
Description:
Competition binding assays were using CHO-K1 cell membranes expressing the opioid receptor.
Residue:
372
  
Inhibitor
Name:
BDBM50088734
Synonyms:
4-{[(1S,3R,5R)-8-(Benzo[1,3]dioxole-5-carbonyl)-8-aza-bicyclo[3.2.1]oct-3-yl]-phenyl-amino}-N,N-diethyl-benzamide | CHEMBL264948
Type:
Small organic molecule
Emp. Form.:
C32H35N3O4
Mol. Mass.:
525.638
SMILES:
CCN(CC)C(=O)c1ccc(cc1)N([C@@H]1C[C@@H]2CC[C@H](C1)N2C(=O)c1ccc2OCOc2c1)c1ccccc1
: