Target
Lysine-specific demethylase 5A
Ligand
BDBM195608
Substrate
Meas. Tech.
ChEMBL_1924989 (CHEMBL4427945)
EC50
5200±n/a nM
Citation
 Gehling, VSBellon, SFHarmange, JCLeBlanc, YPoy, FOdate, SBuker, SLan, FArora, SWilliamson, KESandy, PCummings, RTBailey, CMBergeron, LMao, WGustafson, ALiu, YVanderPorten, EAudia, JETrojer, PAlbrecht, BK Identification of potent, selective KDM5 inhibitors. Bioorg Med Chem Lett 26:4350-4 (2016)  
Target
Name:
Lysine-specific demethylase 5A
Synonyms:
Histone demethylase JARID1A Jumonji/ARID domain-containing protein 1A KDM5A_HUMAN RBBP-2 RBP2 | Retinoblastoma-binding protein 2
Type:
Protein
Mol. Mass.:
192091.79
Organism:
Homo sapiens (Human)
Description:
P29375
Residue:
1690
  
Inhibitor
Name:
BDBM195608
Synonyms:
CPI-455
Type:
Small organic molecule
Emp. Form.:
C16H14N4O
Mol. Mass.:
278.3086
SMILES:
CC(C)c1c([nH]c2c(cnn2c1=O)C#N)-c1ccccc1
: