Target
Urokinase-type plasminogen activator
Ligand
BDBM50088977
Substrate
Meas. Tech.
ChEBML_212977
IC50
19±n/a nM
Citation
 Tamura, SYWeinhouse, MIRoberts, CAGoldman, EAMasukawa, KAnderson, SMCohen, CRBradbury, AEBernardino, VTDixon, SAMa, MGNolan, TGBrunck, TK Synthesis and biological activity of peptidyl aldehyde urokinase inhibitors. Bioorg Med Chem Lett 10:983-7 (2000)  
Target
Name:
Urokinase-type plasminogen activator
Synonyms:
3.4.21.73 U-plasminogen activator Urokinase Urokinase-type plasminogen activator chain B Urokinase-type plasminogen activator short chain A uPA
Type:
Enzyme
Mol. Mass.:
48528.62
Organism:
Homo sapiens (Human)
Description:
P00749
Residue:
431
  
Inhibitor
Name:
BDBM50088977
Synonyms:
CHEMBL177557 | {1-[1-(1-Carbamimidoyl-2-hydroxy-piperidin-3-ylcarbamoyl)-ethylcarbamoyl]-2-hydroxy-ethyl}-carbamic acid benzyl ester
Type:
Small organic molecule
Emp. Form.:
C20H30N6O6
Mol. Mass.:
450.4888
SMILES:
C[C@H](NC(=O)[C@@H](CO)NC(=O)OCc1ccccc1)C(=O)N[C@H]1CCCN(C1O)C(N)=N
: