Target
Metabotropic glutamate receptor 4
Ligand
BDBM50004881
Substrate
Meas. Tech.
ChEMBL_106551 (CHEMBL715496)
EC50
5200±n/a nM
Citation
 Gasparini, FInderbitzin, WFrancotte, ELecis, GRichert, PDragic, ZKuhn, RFlor, PJ (+)-4-phosphonophenylglycine (PPG) a new group III selective metabotropic glutamate receptor agonist. Bioorg Med Chem Lett 10:1241-4 (2000)  
Target
Name:
Metabotropic glutamate receptor 4
Synonyms:
GPRC1D GRM4_HUMAN MGLUR4 Metabotropic glutamate receptor 4 (mGlu4) metabotropic glutamate 4
Type:
Protein
Mol. Mass.:
101899.95
Organism:
Homo sapiens (Human)
Description:
Q14833
Residue:
912
  
Inhibitor
Name:
BDBM50004881
Synonyms:
(RS) PPG Amino-(4-phosphono-phenyl)-acetic acid(RS-PPG) PPG
Type:
Small organic molecule
Emp. Form.:
C8H10NO5P
Mol. Mass.:
231.1425
SMILES:
NC(C(O)=O)c1ccc(cc1)P(O)(O)=O
: