Target
Galectin-3
Ligand
BDBM50077225
Substrate
Meas. Tech.
ChEMBL_1925954 (CHEMBL4429026)
Kd
49000±n/a nM
Citation
 Rajput, VKMacKinnon, AMandal, SCollins, PBlanchard, HLeffler, HSethi, TSchambye, HMukhopadhyay, BNilsson, UJ A Selective Galactose-Coumarin-Derived Galectin-3 Inhibitor Demonstrates Involvement of Galectin-3-glycan Interactions in a Pulmonary Fibrosis Model. J Med Chem 59:8141-7 (2016)  
Target
Name:
Galectin-3
Synonyms:
LEG3_HUMAN MAC2
Type:
Enzyme
Mol. Mass.:
26156.54
Organism:
Homo sapiens (Human)
Description:
P17931
Residue:
250
  
Inhibitor
Name:
BDBM50077225
Synonyms:
(2R,3R,4S,5R,6S)-2-(hydroxymethyl)-6-{[(2S,3R,4S,5R,6R)-3,4,5-trihydroxy-6-(hydroxymethyl)tetrahydro-2H-pyran-2-yl]thio}tetrahydro-2H-pyran-3,4,5-triol THIODIGALACTOSIDE
Type:
Small organic molecule
Emp. Form.:
C12H22O10S
Mol. Mass.:
358.362
SMILES:
OC[C@H]1O[C@@H](S[C@@H]2O[C@H](CO)[C@H](O)[C@H](O)[C@H]2O)[C@H](O)[C@@H](O)[C@H]1O
: