Target
Tyrosine-protein kinase JAK3
Ligand
BDBM50533682
Substrate
Meas. Tech.
ChEMBL_1926454 (CHEMBL4429526)
IC50
0.800000±n/a nM
Citation
 Nakajima, YAoyama, NTakahashi, FSasaki, HHatanaka, KMoritomo, AInami, MIto, MNakamura, KNakamori, FInoue, TShirakami, S Design, synthesis, and evaluation of 4,6-diaminonicotinamide derivatives as novel and potent immunomodulators targeting JAK3. Bioorg Med Chem 24:4711-4722 (2016)  
Target
Name:
Tyrosine-protein kinase JAK3
Synonyms:
JAK-3 JAK3_HUMAN Janus kinase 3 (JAK3) L-JAK | Leukocyte janus kinase
Type:
Protein
Mol. Mass.:
125111.08
Organism:
Homo sapiens (Human)
Description:
P52333
Residue:
1124
  
Inhibitor
Name:
BDBM50533682
Synonyms:
CHEMBL4463436
Type:
Small organic molecule
Emp. Form.:
C23H24N8O
Mol. Mass.:
428.4897
SMILES:
Cc1nccc(Nc2cc(NC3CCN(CC3)c3ccc(cc3)C#N)c(cn2)C(N)=O)n1
: