Target
Adenosine kinase
Ligand
BDBM50533824
Substrate
Meas. Tech.
ChEMBL_1927381 (CHEMBL4430453)
Ki
25200±n/a nM
Citation
 Köse, MSchiedel, ACBauer, AAPoschenrieder, HBurbiel, JCAkkinepally, RRStachel, HDMüller, CE Focused screening to identify new adenosine kinase inhibitors. Bioorg Med Chem 24:5127-5133 (2016)  
Target
Name:
Adenosine kinase
Synonyms:
ADK | ADK_HUMAN
Type:
PROTEIN
Mol. Mass.:
40545.97
Organism:
Homo sapiens (Human)
Description:
ChEMBL_1467841
Residue:
362
  
Inhibitor
Name:
BDBM50533824
Synonyms:
CHEMBL4574016
Type:
Small organic molecule
Emp. Form.:
C19H13ClN4O2
Mol. Mass.:
364.785
SMILES:
CC(=O)Nc1nc(nc2oc(nc12)-c1ccc(Cl)cc1)-c1ccccc1
: