Target
Adenosine kinase
Ligand
BDBM50533834
Substrate
Meas. Tech.
ChEMBL_1927381 (CHEMBL4430453)
Ki
19500±n/a nM
Citation
 Köse, MSchiedel, ACBauer, AAPoschenrieder, HBurbiel, JCAkkinepally, RRStachel, HDMüller, CE Focused screening to identify new adenosine kinase inhibitors. Bioorg Med Chem 24:5127-5133 (2016)  
Target
Name:
Adenosine kinase
Synonyms:
ADK | ADK_HUMAN
Type:
PROTEIN
Mol. Mass.:
40545.97
Organism:
Homo sapiens (Human)
Description:
ChEMBL_1467841
Residue:
362
  
Inhibitor
Name:
BDBM50533834
Synonyms:
CHEMBL4448716
Type:
Small organic molecule
Emp. Form.:
C15H11N3O2S
Mol. Mass.:
297.332
SMILES:
CC(=O)Oc1csc2nc(C)n3c4ccccc4nc3c12
: