Target
Adenosine kinase
Ligand
BDBM50533830
Substrate
Meas. Tech.
ChEMBL_1927381 (CHEMBL4430453)
Ki
8560±n/a nM
Citation
 Köse, MSchiedel, ACBauer, AAPoschenrieder, HBurbiel, JCAkkinepally, RRStachel, HDMüller, CE Focused screening to identify new adenosine kinase inhibitors. Bioorg Med Chem 24:5127-5133 (2016)  
Target
Name:
Adenosine kinase
Synonyms:
ADK | ADK_HUMAN
Type:
PROTEIN
Mol. Mass.:
40545.97
Organism:
Homo sapiens (Human)
Description:
ChEMBL_1467841
Residue:
362
  
Inhibitor
Name:
BDBM50533830
Synonyms:
CHEMBL4460655
Type:
Small organic molecule
Emp. Form.:
C15H14N6S
Mol. Mass.:
310.377
SMILES:
CCCc1nc2n(ncc2c2n[nH]c(=S)n12)-c1ccccc1
: