Target
Polyphenol oxidase 2
Ligand
BDBM50534039
Substrate
Meas. Tech.
ChEMBL_1927666 (CHEMBL4430738)
EC50
17100±n/a nM
Citation
 Niu, CYin, LNie, LFDou, JZhao, JYLi, GAisa, HA Synthesis and bioactivity of novel isoxazole chalcone derivatives on tyrosinase and melanin synthesis in murine B16 cells for the treatment of vitiligo. Bioorg Med Chem 24:5440-5448 (2016)  
Target
Name:
Polyphenol oxidase 2
Synonyms:
Monophenol monooxygenase PPO2 Tyrosinase
Type:
Protein
Mol. Mass.:
63923.66
Organism:
Agaricus bisporus (Common mushroom)
Description:
O42713
Residue:
556
  
Inhibitor
Name:
BDBM50534039
Synonyms:
CHEMBL4473442
Type:
Small organic molecule
Emp. Form.:
C24H18N2O2S
Mol. Mass.:
398.477
SMILES:
Cc1ccc(\C=C\C(=O)c2ccc3nc(NC(=O)c4ccccc4)sc3c2)cc1
: