Target
Polyphenol oxidase 2
Ligand
BDBM50534040
Substrate
Meas. Tech.
ChEMBL_1927666 (CHEMBL4430738)
EC50
30600±n/a nM
Citation
 Niu, CYin, LNie, LFDou, JZhao, JYLi, GAisa, HA Synthesis and bioactivity of novel isoxazole chalcone derivatives on tyrosinase and melanin synthesis in murine B16 cells for the treatment of vitiligo. Bioorg Med Chem 24:5440-5448 (2016)  
Target
Name:
Polyphenol oxidase 2
Synonyms:
Monophenol monooxygenase PPO2 Tyrosinase
Type:
Protein
Mol. Mass.:
63923.66
Organism:
Agaricus bisporus (Common mushroom)
Description:
O42713
Residue:
556
  
Inhibitor
Name:
BDBM50534040
Synonyms:
CHEMBL4468479
Type:
Small organic molecule
Emp. Form.:
C16H11ClN2OS
Mol. Mass.:
314.789
SMILES:
Nc1nc2ccc(cc2s1)C(=O)\C=C\c1ccc(Cl)cc1
: