Target
Polyphenol oxidase 2
Ligand
BDBM50534042
Substrate
Meas. Tech.
ChEMBL_1927666 (CHEMBL4430738)
EC50
56200±n/a nM
Citation
 Niu, CYin, LNie, LFDou, JZhao, JYLi, GAisa, HA Synthesis and bioactivity of novel isoxazole chalcone derivatives on tyrosinase and melanin synthesis in murine B16 cells for the treatment of vitiligo. Bioorg Med Chem 24:5440-5448 (2016)  
Target
Name:
Polyphenol oxidase 2
Synonyms:
Monophenol monooxygenase PPO2 Tyrosinase
Type:
Protein
Mol. Mass.:
63923.66
Organism:
Agaricus bisporus (Common mushroom)
Description:
O42713
Residue:
556
  
Inhibitor
Name:
BDBM50534042
Synonyms:
CHEMBL4469461
Type:
Small organic molecule
Emp. Form.:
C23H17NO3S
Mol. Mass.:
387.451
SMILES:
O=C(\C=C\c1ccccc1)c1ccc(OCc2cc(no2)-c2cccs2)cc1
: