Target
Polyphenol oxidase 2
Ligand
BDBM50534045
Substrate
Meas. Tech.
ChEMBL_1927666 (CHEMBL4430738)
EC50
25500±n/a nM
Citation
 Niu, CYin, LNie, LFDou, JZhao, JYLi, GAisa, HA Synthesis and bioactivity of novel isoxazole chalcone derivatives on tyrosinase and melanin synthesis in murine B16 cells for the treatment of vitiligo. Bioorg Med Chem 24:5440-5448 (2016)  
Target
Name:
Polyphenol oxidase 2
Synonyms:
Monophenol monooxygenase PPO2 Tyrosinase
Type:
Protein
Mol. Mass.:
63923.66
Organism:
Agaricus bisporus (Common mushroom)
Description:
O42713
Residue:
556
  
Inhibitor
Name:
BDBM50534045
Synonyms:
CHEMBL4567344
Type:
Small organic molecule
Emp. Form.:
C26H18F3NO4
Mol. Mass.:
465.4206
SMILES:
FC(F)(F)Oc1cccc(c1)-c1cc(COc2ccc(cc2)C(=O)\C=C\c2ccccc2)on1
: