Target
Polyphenol oxidase 2
Ligand
BDBM50534054
Substrate
Meas. Tech.
ChEMBL_1927666 (CHEMBL4430738)
EC50
11400±n/a nM
Citation
 Niu, CYin, LNie, LFDou, JZhao, JYLi, GAisa, HA Synthesis and bioactivity of novel isoxazole chalcone derivatives on tyrosinase and melanin synthesis in murine B16 cells for the treatment of vitiligo. Bioorg Med Chem 24:5440-5448 (2016)  
Target
Name:
Polyphenol oxidase 2
Synonyms:
Monophenol monooxygenase PPO2 Tyrosinase
Type:
Protein
Mol. Mass.:
63923.66
Organism:
Agaricus bisporus (Common mushroom)
Description:
O42713
Residue:
556
  
Inhibitor
Name:
BDBM50534054
Synonyms:
CHEMBL4463325
Type:
Small organic molecule
Emp. Form.:
C23H16INO4
Mol. Mass.:
497.2819
SMILES:
Ic1ccc(o1)-c1cc(COc2ccc(cc2)C(=O)\C=C\c2ccccc2)on1
: