Target
Polyphenol oxidase 2
Ligand
BDBM50534058
Substrate
Meas. Tech.
ChEMBL_1927666 (CHEMBL4430738)
EC50
23900±n/a nM
Citation
 Niu, CYin, LNie, LFDou, JZhao, JYLi, GAisa, HA Synthesis and bioactivity of novel isoxazole chalcone derivatives on tyrosinase and melanin synthesis in murine B16 cells for the treatment of vitiligo. Bioorg Med Chem 24:5440-5448 (2016)  
Target
Name:
Polyphenol oxidase 2
Synonyms:
Monophenol monooxygenase PPO2 Tyrosinase
Type:
Protein
Mol. Mass.:
63923.66
Organism:
Agaricus bisporus (Common mushroom)
Description:
O42713
Residue:
556
  
Inhibitor
Name:
BDBM50534058
Synonyms:
CHEMBL4462990
Type:
Small organic molecule
Emp. Form.:
C26H22ClN3O
Mol. Mass.:
427.925
SMILES:
Clc1ccc(Cn2cc(CCc3ccc(cc3)C(=O)\C=C\c3ccccc3)nn2)cc1
: