Target
Polyphenol oxidase 2
Ligand
BDBM50534059
Substrate
Meas. Tech.
ChEMBL_1927666 (CHEMBL4430738)
EC50
78100±n/a nM
Citation
 Niu, CYin, LNie, LFDou, JZhao, JYLi, GAisa, HA Synthesis and bioactivity of novel isoxazole chalcone derivatives on tyrosinase and melanin synthesis in murine B16 cells for the treatment of vitiligo. Bioorg Med Chem 24:5440-5448 (2016)  
Target
Name:
Polyphenol oxidase 2
Synonyms:
Monophenol monooxygenase PPO2 Tyrosinase
Type:
Protein
Mol. Mass.:
63923.66
Organism:
Agaricus bisporus (Common mushroom)
Description:
O42713
Residue:
556
  
Inhibitor
Name:
BDBM50534059
Synonyms:
CHEMBL4471626
Type:
Small organic molecule
Emp. Form.:
C25H19NO3
Mol. Mass.:
381.4233
SMILES:
O=C(\C=C\c1ccccc1)c1ccc(OCc2cc(no2)-c2ccccc2)cc1
: