Target
Acetylcholinesterase
Ligand
BDBM50089617
Substrate
Meas. Tech.
ChEBML_28626
IC50
>93000±n/a nM
Citation
 Obata, RSunazuka, TOtoguro, KTomoda, HHarigaya, YOmura, S Synthetic conversion of ACAT inhibitor to acetylcholinesterase inhibitor. Bioorg Med Chem Lett 10:1315-6 (2000)  
Target
Name:
Acetylcholinesterase
Synonyms:
ACES_HUMAN Acetylcholinesterase (AChE) | Acetylcholinesterase (human AChE)
Type:
Enzyme
Mol. Mass.:
67792.70
Organism:
Homo sapiens (Human)
Description:
P22303
Residue:
614
  
Inhibitor
Name:
BDBM50089617
Synonyms:
3,6-Dihydroxy-4-hydroxymethyl-9-(3-methoxy-phenyl)-4,6a,12b-trimethyl-1,2,3,4,4a,5,6,6a,12a,12b-decahydro-7,10-dioxa-benzo[a]anthracene-11,12-dione | CHEMBL24457
Type:
Small organic molecule
Emp. Form.:
C27H32O8
Mol. Mass.:
484.5382
SMILES:
COc1cccc(c1)-c1cc2O[C@]3(C)[C@@H](O)CC4C(C)(CO)[C@@H](O)CC[C@]4(C)C3C(=O)c2c(=O)o1
: