Target
Endothelin-1 receptor
Ligand
BDBM50089709
Substrate
Meas. Tech.
ChEBML_63354
IC50
1900±n/a nM
Citation
 Zhang, JDidierlaurent, SFortin, MLefrançois, DUridat, EVevert, JP Nonpeptide endothelin antagonists: from lower affinity pyrazol-5-ols to higher affinity pyrazole-5-carboxylic acids. Bioorg Med Chem Lett 10:1351-5 (2000)  
Target
Name:
Endothelin-1 receptor
Synonyms:
EDNRA_RAT Ednra Endothelin-1 receptor
Type:
Enzyme Catalytic Domain
Mol. Mass.:
48256.91
Organism:
RAT
Description:
ENDOTHELIN A EDNRA RAT::P26684
Residue:
426
  
Inhibitor
Name:
BDBM50089709
Synonyms:
4-Benzo[1,3]dioxol-5-ylmethyl-2-(3-chloro-benzyl)-5-trifluoromethyl-2H-pyrazol-3-ol | CHEMBL3144806
Type:
Small organic molecule
Emp. Form.:
C19H14ClF3N2O3
Mol. Mass.:
410.774
SMILES:
FC(F)(F)c1[nH]n(Cc2cccc(Cl)c2)c(=O)c1Cc1ccc2OCOc2c1
: