Target
Endothelin receptor type B
Ligand
BDBM50089712
Substrate
Meas. Tech.
ChEBML_64043
IC50
24000±n/a nM
Citation
 Zhang, JDidierlaurent, SFortin, MLefrançois, DUridat, EVevert, JP Nonpeptide endothelin antagonists: from lower affinity pyrazol-5-ols to higher affinity pyrazole-5-carboxylic acids. Bioorg Med Chem Lett 10:1351-5 (2000)  
Target
Name:
Endothelin receptor type B
Synonyms:
EDNRB_RAT ET-B Endothelin receptor | Endothelin receptor non-selective type
Type:
Enzyme Catalytic Domain
Mol. Mass.:
49483.43
Organism:
RAT
Description:
ENDOTHELIN B EDNRB RAT::P21451
Residue:
442
  
Inhibitor
Name:
BDBM50089712
Synonyms:
4-Benzo[1,3]dioxol-5-ylmethyl-2-benzyl-5-trifluoromethyl-2H-pyrazol-3-ol | CHEMBL3144845
Type:
Small organic molecule
Emp. Form.:
C19H15F3N2O3
Mol. Mass.:
376.3292
SMILES:
FC(F)(F)c1[nH]n(Cc2ccccc2)c(=O)c1Cc1ccc2OCOc2c1
: