Target
Endothelin-1 receptor
Ligand
BDBM50089719
Substrate
Meas. Tech.
ChEBML_63354
IC50
2100±n/a nM
Citation
 Zhang, JDidierlaurent, SFortin, MLefrançois, DUridat, EVevert, JP Nonpeptide endothelin antagonists: from lower affinity pyrazol-5-ols to higher affinity pyrazole-5-carboxylic acids. Bioorg Med Chem Lett 10:1351-5 (2000)  
Target
Name:
Endothelin-1 receptor
Synonyms:
EDNRA_RAT Ednra Endothelin-1 receptor
Type:
Enzyme Catalytic Domain
Mol. Mass.:
48256.91
Organism:
RAT
Description:
ENDOTHELIN A EDNRA RAT::P26684
Residue:
426
  
Inhibitor
Name:
BDBM50089719
Synonyms:
4-Benzo[1,3]dioxol-5-ylmethyl-2-(4-methoxy-benzyl)-5-trifluoromethyl-2H-pyrazol-3-ol | CHEMBL3144799
Type:
Small organic molecule
Emp. Form.:
C20H17F3N2O4
Mol. Mass.:
406.3552
SMILES:
COc1ccc(Cn2[nH]c(c(Cc3ccc4OCOc4c3)c2=O)C(F)(F)F)cc1
: