Target
Endothelin-1 receptor
Ligand
BDBM50089716
Substrate
Meas. Tech.
ChEBML_63354
IC50
18±n/a nM
Citation
 Zhang, JDidierlaurent, SFortin, MLefrançois, DUridat, EVevert, JP Nonpeptide endothelin antagonists: from lower affinity pyrazol-5-ols to higher affinity pyrazole-5-carboxylic acids. Bioorg Med Chem Lett 10:1351-5 (2000)  
Target
Name:
Endothelin-1 receptor
Synonyms:
EDNRA_RAT Ednra Endothelin-1 receptor
Type:
Enzyme Catalytic Domain
Mol. Mass.:
48256.91
Organism:
RAT
Description:
ENDOTHELIN A EDNRA RAT::P26684
Residue:
426
  
Inhibitor
Name:
BDBM50089716
Synonyms:
4-(6-Chloro-benzo[1,3]dioxol-5-ylmethyl)-2-(3-methoxy-benzyl)-5-phenyl-2H-pyrazole-3-carboxylic acid | CHEMBL26474
Type:
Small organic molecule
Emp. Form.:
C26H21ClN2O5
Mol. Mass.:
476.908
SMILES:
COc1cccc(Cn2nc(c(Cc3cc4OCOc4cc3Cl)c2C(O)=O)-c2ccccc2)c1
: